{"text_format":"1","workbook":"xlsx","n_sheets":9,"sheets":["Sheet1","Data","Calculation a","Calculation","PAYE VS Portfolio","Agency Report",".","Umbrella rates","PAYE rates"],"not_rendered":{"charts":0,"images":2,"macros":1,"external_links":2,"defined_names":126,"comments":0,"pivot_tables":0},"unopened":[],"bounds":{"document_bytes":16777216,"sheet_cells":100000,"rows_first":2000,"rows_last":500,"rows_between":2000,"halvings":0,"cell_chars":16384,"cell_head_chars":4096},"cells_cut":0,"cells_raw":0,"read":"whole","date_system":"1900"}

{"sheet":"Sheet1","index":0,"n_rows":53,"n_cols":10,"rows_kept":53,"cut":false,"hidden":false,"merged":[[52,1,52,2],[52,5,52,6],[27,1,28,7],[30,2,30,5],[4,1,5,7],[10,1,11,7],[18,1,19,7],[29,6,31,7],[49,1,50,7],[33,1,34,7],[35,6,37,7],[36,2,36,5]]}
[]
[null,"2019/20 - Key Portfolio Rate Calculator"]
[null,"Complete Section 1 and then calculate the Key Portfolio rate in Section 2:"]
[]
[null,"1 - Enter assignment details (optional)"]
[]
[]
[null,"Enter the client booking charge",0,null,null,null,null,null,null,{"$f":"IF(C8=0,IF(G8=0,0,G8),C8)","v":0}]
[]
[]
[null,"Section 1 - Complete all fields"]
[]
[]
[null,"Select the candidate's age range",null,null,null,"Enter the PAYE rate",0,null,null,{"$f":"IF(G14=0,0,G14)","v":0}]
[]
{"$rows_left_out":39}
{"sheet":"Data","index":1,"n_rows":31,"n_cols":13,"rows_kept":31,"cut":false,"hidden":true,"merged":[]}
[]
["Input"]
[null,"Total no of billers",1,null,null,null,null,null,null,null,"please select","Agency"]
[]
[1,"Sector","Education","Select From List",null,null,null,null,null,10,"Expenses:"]
[]
[2,"Tax Code","1250L","Tax Regime",null,"UK",null,null,null,null,"Total Expenses",null,0]
[]
[3,"Pay Cycle","Weekly","Select From List"]
[]
[4,"Fee","Portfolio",null,null,null,null,null,null,11,"Options"]
[null,null,"Percentage",null,null,null,null,{"$f":"IF(D13=0,C13,D13)","v":0.04}]
[null,"a) Percent ",{"$f":"IF($C$9='.'!$I$14,'.'!L3,IF(Data!$C$9='.'!$I$15,'.'!L6,'.'!L9))","v":0.04},null,null,null,null,null,null,null,"Student Loan","NO","Select From List"]
[null,"b) MAX",{"$f":"IF($C$9='.'!$I$14,'.'!L4,IF(Data!$C$9='.'!$I$15,'.'!L7,'.'!L10))","v":16},null,null,null,null,null,null,null,"Post Graduate Loan","NO","Select From List"]
[null,"c) Min",{"$f":"IF($C$9='.'!$I$14,'.'!L5,IF(Data!$C$9='.'!$I$15,'.'!L8,'.'!L11))","v":0},null,null,null,null,null,null,null,"NI Exempt","NO","Select From List"]
{"$rows_left_out":17}
{"sheet":"Calculation a","index":2,"n_rows":47,"n_cols":16378,"rows_kept":47,"cut":false,"hidden":true,"merged":[[4,15,4,16],[4,6,4,9],[3,15,3,16],[1,0,1,3],[3,4,3,5],[3,13,3,14],[3,6,3,9]]}
[]
[]
[]
[null,null,null,null,"PAYE",null,"Portfolio",null,null,null,null,null,null,"PAYE",null,"Portfolio"]
[{"$f":"IF(Data!C9=\"Weekly\",\"Weekly Gross Income\",IF(Data!C9=\"Fortnightly\",\"Fortnightly Gross Income\",IF(Data!C9=\"Monthly\",\"Monthly Gross Income\",\"4 Weekly Gross Income\")))","v":"Weekly Gross Income"}]
[null,"UNIT",null,"RATE"]
["Funds Received",{"$f":"IF(Data!$C$23>0,Data!$C$23,Data!$C$21)","v":0},"@",{"$f":"Data!C19","v":0},null,{"$f":"IF(Data!C5<>\"\",Data!$C$25,\"\")","v":0},{"$f":"'Agency Report'!G5","v":0},"@",{"$f":"'Agency Report'!G6","v":0},{"$f":"'Agency Report'!G5*'Agency Report'!G6","v":0},null,null,"Employee Income",null,null,null,{"$f":"J30","v":0}]
[null,null,null,null,null,null,null,null,null,null,null,null,"Holiday Pay",null,null,null,{"$f":"IF(Data!L16=\"NO\",'Calculation a'!I28,0)","v":0}]
["Minimum Wage",null,null,null,null,null,null,null,{"$f":"'.'!D13","v":0},null,null,null,"Taxable Income",null,{"$f":"F7","v":0},null,{"$f":"Q7+Q8","v":0}]
["HP on Minimum Wage",null,null,null,null,null,null,null,{"$f":"ROUND(I9*Data!C17,2)","v":0},null,null,null,null,null,null,null,null,null,{"$f":"ROUND((IF(Data!$C$9=\"Weekly\",'.'!$A$3,0)),2)","v":166}]
["Auto-enrolment - Employer",null,null,null,null,null,null,null,{"$f":"ROUND(IF(Data!L17=\"yes\",IF(IF(Data!C9=\"Weekly\",IF(SUM(I9:I10)>'.'!E22,'.'!E22-'.'!E21,SUM(I9:I10)-'.'!E21),IF(Data!C9=\"Fortnightly\",IF(SUM(I9:I10)>'.'!F22,'.'!F22-'.'!F21,SUM(I9:I10)-'.'!F21),IF(Data!C9=\"4 Weekly\",IF(SUM(I9:I10)>'.'!H22,'.'!H22-'.'!H21,SUM(I9:I10)-'.'!H21),IF(Data!C9=\"Monthly\",IF(SUM(I9:I10)>'.'!G22,'.'!G22-'.'!G21,SUM(I9:I10)-'.'!G21),0))))<0,0,IF(Data!C9=\"Weekly\",IF(SUM(I9:I10)>'.'!E22,'.'!E22-'.'!E21,SUM(I9:I10)-'.'!E21),IF(Data!C9=\"Fortnightly\",IF(SUM(I9:I10)>'.'!F22,'.'!F22-'.'!F21,SUM(I9:I10)-'.'!F21),IF(Data!C9=\"4 Weekly\",IF(SUM(I9:I10)>'.'!H22,'.'!H22-'.'!H21,SUM(I9:I10)-'.'!H21),IF(Data!C9=\"Monthly\",IF(SUM(I9:I10)>'.'!G22,'.'!G22-'.'!G21,SUM(I9:I10)-'.'!G21),0)))))*'.'!B22,0),2)","v":0},null,null,null,"ERP - Reportable",null,null,null,{"$f":"IF(Data!L17=\"yes\",IF(IF(Data!C9=\"Weekly\",IF(Q9>'.'!E22,'.'!E22-'.'!E21,Q9-'.'!E21),IF(Data!C9=\"Fortnightly\",IF(Q9>'.'!F22,'.'!F22-'.'!F21,Q9-'.'!F21),IF(Data!C9=\"4 Weekly\",IF(Q9>'.'!H22,'.'!H22-'.'!H21,Q9-'.'!H21),IF(Data!C9=\"Monthly\",IF(Q9>'.'!G22,'.'!G22-'.'!G21,Q9-'.'!G21),0))))<0,0,IF(Data!C9=\"Weekly\",IF(Q9>'.'!E22,'.'!E22-'.'!E21,Q9-'.'!E21),IF(Data!C9=\"Fortnightly\",IF(Q9>'.'!F22,'.'!F22-'.'!F21,Q9-'.'!F21),IF(Data!C9=\"4 Weekly\",IF(Q9>'.'!H22,'.'!H22-'.'!H21,Q9-'.'!H21),IF(Data!C9=\"Monthly\",IF(Q9>'.'!G22,'.'!G22-'.'!G21,Q9-'.'!G21),0)))))*'.'!B22,0)","v":0}]
["Apprenticeship Levy",null,null,null,null,null,null,null,{"$f":"ROUND(SUM(I9:I10)*'.'!B5,2)","v":0}]
["ERNIC on Minimum Wage",null,null,null,null,null,null,null,{"$f":"ROUND(IF(IF(Data!C5<>\"\",IF('Calculation a'!I9+I10>'.'!A3,(IF(Data!C9=\"Monthly\",+('Calculation a'!I9+I10-'.'!C3)*0.138,(IF(Data!C9=\"Fortnightly\",+('Calculation a'!I9+I10-'.'!B3)*0.138,(IF(Data!C9=\"4 weekly\",+('Calculation a'!I9+I10-'.'!D3)*0.138,('Calculation a'!I9+I10-'.'!A3)*0.138)))))),0),\"\")<0,0,IF(Data!C5<>\"\",IF('Calculation a'!I9+I10>'.'!A3,(IF(Data!C9=\"Monthly\",+('Calculation a'!I9+I10-'.'!C3)*0.138,(IF(Data!C9=\"Fortnightly\",+('Calculation a'!I9+I10-'.'!B3)*0.138,(IF(Data!C9=\"4 weekly\",+('Calculation a'!I9+I10-'.'!D3)*0.138,('Calculation a'!I9+I10-'.'!A3)*0.138)))))),0),\"\")),2)","v":0},null,null,null,"Income Tax",{"$f":"IF(Data!F7=\"S\",'PAYE rates'!B39,'PAYE rates'!B19)","v":0},null,{"$f":"IF(Data!F7=\"S\",'Umbrella rates'!B39,'Umbrella rates'!B19)","v":0},null,null,{"$f":"ROUND((IF(Data!$C$9=\"Fortnightly\",'.'!$B$3)),2)","v":0}]
["Amount for Deduction",null,null,null,null,null,null,null,{"$f":"J7-SUM(I9:I13)","v":0},null,null,null,"Employee's National Insurance",{"$f":"IF(Data!L15=\"YES\",0,'PAYE rates'!B56)","v":0},null,{"$f":"IF(Data!L15=\"YES\",0,'Umbrella rates'!B56)","v":0},null,null,{"$f":"ROUND((IF(Data!$C$9=\"Monthly\",'.'!$C$3)),2)","v":0}]
[null,null,null,null,null,null,null,null,null,null,null,null,"Student Loan",{"$f":"ROUNDDOWN(IF(Data!L13=\"Plan 1\",'.'!F25,IF(Data!L13=\"Plan 2\",'.'!F26,0)),0)","v":0},null,{"$f":"ROUNDDOWN(IF(Data!L13=\"Plan 1\",'.'!G25,IF(Data!L13=\"Plan 2\",'.'!G26,0)),0)","v":0},null,null,{"$f":"ROUND((IF(Data!$C$9=\"4 weekly\",'.'!$D$3,0)),2)","v":0}]
{"$rows_left_out":33}
{"sheet":"Calculation","index":3,"n_rows":40,"n_cols":13,"rows_kept":40,"cut":false,"hidden":true,"merged":[[4,6,4,9],[1,0,1,3],[3,4,3,5],[3,6,3,9]]}
[]
[]
[]
[null,null,null,null,"PAYE",null,"Portfolio"]
[{"$f":"IF(Data!C9=\"Weekly\",\"Weekly Gross Income\",IF(Data!C9=\"Fortnightly\",\"Fortnightly Gross Income\",IF(Data!C9=\"Monthly\",\"Monthly Gross Income\",\"4 Weekly Gross Income\")))","v":"Weekly Gross Income"}]
[null,"UNIT",null,"RATE"]
["Funds Received",{"$f":"'Calculation a'!B7","v":0},"@",{"$f":"'Calculation a'!D7","v":0},null,{"$f":"'Calculation a'!F7","v":0},{"$f":"'Calculation a'!G7","v":0},"@",{"$f":"'Calculation a'!I7","v":0},{"$f":"'Calculation a'!J7","v":0}]
[]
["Expenditure",null,null,null,null,null,null,null,null,null,null,"Employers Outgoings"]
["Margin",null,null,null,null,null,null,null,{"$f":"'Calculation a'!I18","v":0},null,null,"Employer’s National Insurance",{"$f":"'Calculation a'!I27","v":0}]
["Employers Outgoings",null,null,null,null,null,null,null,{"$f":"SUM(M10:M12)","v":0},null,null,"Apprenticeship Levy",{"$f":"'Calculation a'!I26","v":0}]
["Holiday Pay",null,null,null,null,null,null,null,{"$f":"'Calculation a'!I28","v":0},null,null,"Employer’s Pension Contribution",{"$f":"'Calculation a'!I25","v":0}]
["Expenses",null,null,null,null,null,null,null,{"$f":"'Calculation a'!I19","v":0},{"$f":"SUM(I10:I13)","v":0},null,null,{"$f":"SUM(M10:M12)","v":0}]
[]
["Gross Salary",null,null,null,null,null,null,null,null,{"$f":"'Calculation a'!Q7","v":0}]
{"$rows_left_out":26}
{"sheet":"PAYE VS Portfolio","index":4,"n_rows":41,"n_cols":16376,"rows_kept":41,"cut":false,"hidden":true,"merged":[[4,6,4,9],[4,13,4,14],[1,0,1,3],[3,4,3,5],[3,11,3,12],[3,13,3,14],[3,6,3,9]]}
[]
[]
[]
[null,null,null,null,"PAYE",null,"Portfolio",null,null,null,null,"PAYE",null,"Portfolio"]
[{"$f":"IF(Data!C9=\"Weekly\",\"Weekly Gross Income\",IF(Data!C9=\"Fortnightly\",\"Fortnightly Gross Income\",IF(Data!C9=\"Monthly\",\"Monthly Gross Income\",\"4 Weekly Gross Income\")))","v":"Weekly Gross Income"}]
[null,"UNIT",null,"RATE"]
["Funds Received",{"$f":"'Calculation a'!B7","v":0},"@",{"$f":"'Calculation a'!D7","v":0},null,{"$f":"'Calculation a'!F7","v":0},{"$f":"'Calculation a'!G7","v":0},"@",{"$f":"'Calculation a'!I7","v":0},{"$f":"'Calculation a'!J7","v":0},"Taxable Income",null,null,null,{"$f":"'Calculation a'!Q7","v":0}]
[null,null,null,null,null,null,null,null,null,null,"Holiday Pay (advance payment from Holiday Pay Reserve)",null,null,null,{"$f":"'Calculation a'!Q8","v":0}]
["Minimum Wage",null,null,null,null,null,null,null,{"$f":"'Calculation a'!I9","v":0},null,"Gross Salary",null,{"$f":"'Calculation a'!O9","v":0},null,{"$f":"'Calculation a'!Q9","v":0}]
["HP on Minimum Wage",null,null,null,null,null,null,null,{"$f":"'Calculation a'!I10","v":0}]
["ERNIC on Minimum Wage",null,null,null,null,null,null,null,{"$f":"'Calculation a'!I13","v":0},null,"Income Tax",{"$f":"'Calculation a'!N13","v":0},null,{"$f":"'Calculation a'!P13","v":0}]
["Amount for Deduction",null,null,null,null,null,null,null,{"$f":"'Calculation a'!I14","v":0},null,"Employee's National Insurance",{"$f":"'Calculation a'!N16","v":0},{"$f":"'Calculation a'!O16","v":0},{"$f":"'Calculation a'!P16","v":0},{"$f":"'Calculation a'!Q16","v":0}]
[]
[null,null,null,null,null,null,null,null,null,null,"Net Salary",null,{"$f":"'Calculation a'!O18","v":0},null,{"$f":"'Calculation a'!Q18","v":0}]
["Expenditure",null,null,null,null,null,null,null,null,null,"Expenses",null,null,null,{"$f":"'Calculation a'!Q19","v":0}]
{"$rows_left_out":27}
{"sheet":"Agency Report","index":5,"n_rows":27,"n_cols":7,"rows_kept":27,"cut":false,"hidden":true,"merged":[[1,2,2,4],[1,5,2,7]]}
[]
[null,null,"PAYE",null,null,"Portfolio     "]
[]
[]
[null,null,"UNITS",{"$f":"IF(Data!$C$23>0,Data!$C$23,Data!$C$21)","v":0},null,"UNITS",{"$f":"IF(Data!$C$23>0,Data!$C$23,Data!$C$21)","v":0}]
["RATES",null,"RATE",{"$f":"IF(Data!L3=\"Agency\",Data!C19,\"\")","v":0},null,"RATE",{"$f":"ROUND(Sheet1!C31,2)","v":0}]
[]
["Total Gross For"]
["All Candidates",null,null,{"$f":"IF(Data!L3=\"Agency\",D15*Data!C3,\"\")","v":0},null,null,{"$f":"IF(Data!L3=\"Agency\",Data!C3*'Agency Report'!G15,\"\")","v":0}]
[]
["Total ERNI for"]
["All Candidates",null,null,{"$f":"IF(Data!L3=\"Agency\",D21*Data!C3,\"\")","v":0},null,null,0]
[]
["Gross pay"]
["per Candidate",null,null,{"$f":"IF(Data!L3=\"Agency\",'Calculation a'!F7,\"\")","v":0},null,null,{"$f":"IF(Data!L3=\"Agency\",G5*G6,0)-ROUND(IF(Data!L16=\"NO\",0,(G5*G6)*Data!C17),2)","v":0}]
{"$rows_left_out":13}
{"sheet":".","index":6,"n_rows":29,"n_cols":12,"rows_kept":29,"cut":false,"hidden":true,"merged":[]}
[0.13800000000000001,"Employers NI Allowance",null,null,null,null,null,null,null,"Fees"]
["Weekly","Fortnightly","Monthly","4 Weekly",null,null,null,null,null,"Education","Non-Educatiion"]
[166,{"$f":"A3*2","v":332},719,{"$f":"A3*4","v":664},null,null,"Weekly",null,"Precent",0.04,0.04,{"$f":"IF(Data!$C$5='.'!$H$16,'.'!K3,'.'!J3)","v":0.04}]
[null,null,null,null,null,null,null,null,"Max",16,16,{"$f":"IF(Data!$C$5='.'!$H$16,'.'!K4,'.'!J4)","v":16}]
["Apprenticeship Levy",5.0000000000000001E-3,null,"Min WAGE",8.2100000000000009,null,null,null,"Min",0,0,{"$f":"IF(Data!$C$5='.'!$H$16,'.'!K5,'.'!J5)","v":0}]
[null,null,null,null,null,null,"Fortnightly",null,"Precent",0.04,0.04,{"$f":"IF(Data!$C$5='.'!$H$16,'.'!K6,'.'!J6)","v":0.04}]
[null,"Weekly Salary","Fortnightly Salary","4 weekly","monthly Salary","Yearly Salary",null,null,"Max",32,32,{"$f":"IF(Data!$C$5='.'!$H$16,'.'!K7,'.'!J7)","v":32}]
["Edu",{"$f":"Data!C21*'.'!$A$18*E5","v":0},{"$f":"Data!C21*'.'!$A$18*E5","v":0},{"$f":"Data!C21*'.'!$A$18*E5","v":0},{"$f":"Data!C21*'.'!$A$18*E5","v":0},null,null,null,"Min",0,0,{"$f":"IF(Data!$C$5='.'!$H$16,'.'!K8,'.'!J8)","v":0}]
["Rest",{"$f":"Data!C21*'.'!$C$18*E5","v":0},{"$f":"Data!C21*'.'!C18*E5","v":0},{"$f":"Data!C21*'.'!C18*E5","v":0},{"$f":"Data!C21*'.'!C18*E5","v":0},null,"4 weekly/Monthly",null,"Precent",0.04,0.04,{"$f":"IF(Data!$C$5='.'!$H$16,'.'!K9,'.'!J9)","v":0.04}]
["Port",{"$f":"Data!C21*'.'!$D$18*E5","v":0},{"$f":"Data!C21*'.'!$D$18*E5","v":0},{"$f":"Data!C21*'.'!$D$18*E5","v":0},{"$f":"Data!C21*'.'!$D$18*E5","v":0},null,null,null,"Max",60,60,{"$f":"IF(Data!$C$5='.'!$H$16,'.'!K10,'.'!J10)","v":60}]
[null,{"$f":"Data!C21*'.'!$B$18*E5","v":0},{"$f":"Data!C21*'.'!B18*E5","v":0},{"$f":"Data!C21*'.'!B18*E5","v":0},{"$f":"Data!C21*'.'!B18*E5","v":0},null,null,null,"Min",0,0,{"$f":"IF(Data!$C$5='.'!$H$16,'.'!K11,'.'!J11)","v":0}]
[null,null,null,null,null,{"$f":"IF(Data!C5<>\"\",IF('Calculation a'!J24>A3,(IF(Data!C9=\"Monthly\",+('Calculation a'!J24-C3)*0.138/1.138,(IF(Data!C9=\"Fortnightly\",+('Calculation a'!J24-B3)*0.138/1.138,(IF(Data!C9=\"4 weekly\",+('Calculation a'!J24-D3)*0.138/1.138,('Calculation a'!J24-A3)*0.138/1.138)))))),0),\"\")","v":0},null,"Drop downs"]
[null,"Threshold","Min wage",{"$f":"IF(Data!C23>0,Data!C23*'.'!E5,IF(Data!C5=\"Education\",A18*Data!C21*E5+F13,IF(Data!C5='.'!H15,'.'!D18*Data!C21*'.'!E5+F13,IF(Data!C5='.'!H16,'.'!D18*Data!C21*'.'!E5+F13,D18*Data!C21*E5+F13))))","v":0},null,0,null,null,"Frequency"]
[null,null,"Expenses",{"$f":"'Calculation a'!I14-'Calculation a'!I18","v":0},null,null,"1250L","Education","Weekly","YES"]
[null,null,null,null,null,null,"0T","Medical And Social Care","Fortnightly","NO"]
{"$rows_left_out":15}
{"sheet":"Umbrella rates","index":7,"n_rows":77,"n_cols":26,"rows_kept":77,"cut":false,"hidden":true,"merged":[[65,15,65,16],[27,3,27,4],[27,7,27,8],[27,11,27,12],[47,15,47,16],[60,6,62,10],[64,1,64,2],[65,3,65,4],[65,7,65,8],[65,11,65,12],[1,1,1,6],[1,8,1,13],[7,1,7,2],[8,3,8,4],[8,7,8,8],[8,11,8,12],[8,15,8,16],[43,4,44,8],[46,1,46,2],[47,3,47,4],[47,7,47,8],[47,11,47,12],[22,6,24,10],[26,1,26,2],[27,15,27,16]]}
[]
[null,"Scroll down for Scottish Tax Bands and Pension Calculations",null,null,null,null,null,null,"Input the Annual Allowance and Total Taxable Income and the calculations will be made for you!"]
[]
[null,"Annual Allowance",{"$f":"F4","v":12500},null,{"$f":"Data!C7","v":"1250L"},{"$f":"IF(RIGHT(E4,1)=\"L\",E5,IF(RIGHT(E4,1)=\"M\",E5,IF(RIGHT(E4,1)=\"n\",E5,IF(RIGHT(E4,1)=\"T\",E5,0))))","v":12500}]
[null,"Total taxable income",{"$f":"Calculation!$J$17","v":0},null,{"$f":"(LEFT(E4,LEN(E4)-1))*10","v":12500}]
[]
[]
[null,"Income Tax Calculations",null,null,null,null,null,null,null,null,null,null,null,null,null,null,null,null,null,null,null,null,"weekly","Fortnightly","4-weekly","monthly"]
[null,null,null,"Weekly ",null,null,null,"F/nightly",null,null,null,"4-weekly",null,null,null,"Monthly",null,null,null,null,null,"BR",721,1442,2885,3125]
[null,null,null,"Allowance",{"$f":"C4/52*Data!L22","v":240.38461538461539},null,null,"Allowance",{"$f":"C4/26*Data!L22","v":480.76923076923077},null,null,"Allowance",{"$f":"C4/13*Data!L22","v":961.53846153846155},null,null,"Allowance",{"$f":"C4/12*Data!L22","v":1041.6666666666667},null,null,null,null,"HR",2163,4327,8654,9375]
[null,null,null,"Income",{"$f":"C5","v":0},null,null,"Income ",{"$f":"C5","v":0},null,null,"Income",{"$f":"C5","v":0},null,null,"Income ",{"$f":"C5","v":0},null,null,null,null,"AR",2885,5770,11538,12500]
[null,null,null,"Minus PA",{"$f":"E11-E10","v":-240.38461538461539},null,null,"Minus PA",{"$f":"I11-I10","v":-480.76923076923077},null,null,"Minus PA",{"$f":"M11-M10","v":-961.53846153846155},null,null,"Minus PA",{"$f":"Q11-Q10","v":-1041.6666666666667}]
[]
[null,null,null,null,"Tax",null,null,null,"Tax",null,null,null,"Tax",null,null,null,"Tax"]
[null,null,0.2,{"$f":"IF(E12>BR_W,BR_W,E12)","v":-240.38461538461539},{"$f":"IF($E$4=\"BR\",ROUNDDOWN($C$5,0)*C15,IF($E$4=\"d0\",0,IF($E$4=\"D1\",0,ROUNDDOWN(D15,0)*C15)))","v":-48},null,0.2,{"$f":"IF(I12>BR_F,BR_F,I12)","v":-480.76923076923077},{"$f":"IF($E$4=\"BR\",ROUNDDOWN($C$5,0)*G15,IF($E$4=\"d0\",0,IF($E$4=\"D1\",0,ROUNDDOWN(H15,0)*G15)))","v":-96},null,0.2,{"$f":"IF(M12>BR_4W,BR_4W,M12)","v":-961.53846153846155},{"$f":"IF($E$4=\"BR\",ROUNDDOWN($C$5,0)*K15,IF($E$4=\"d0\",0,IF($E$4=\"D1\",0,ROUNDDOWN(L15,0)*K15)))","v":-192.20000000000002},null,0.2,{"$f":"IF(Q12>BR_M,BR_M,Q12)","v":-1041.6666666666667},{"$f":"IF($E$4=\"BR\",ROUNDDOWN($C$5,0)*O15,IF($E$4=\"d0\",0,IF($E$4=\"D1\",0,ROUNDDOWN(P15,0)*O15)))","v":-208.20000000000002},null,null,37500]
{"$rows_left_out":63}
{"sheet":"PAYE rates","index":8,"n_rows":77,"n_cols":26,"rows_kept":77,"cut":false,"hidden":true,"merged":[[1,1,1,6],[1,8,1,13],[7,1,7,2],[8,3,8,4],[8,7,8,8],[8,11,8,12],[8,15,8,16],[43,4,44,8],[46,1,46,2],[47,3,47,4],[47,7,47,8],[47,11,47,12],[47,15,47,16],[22,6,24,10],[26,1,26,2],[27,3,27,4],[27,7,27,8],[27,11,27,12],[65,15,65,16],[27,15,27,16],[60,6,62,10],[64,1,64,2],[65,3,65,4],[65,7,65,8],[65,11,65,12]]}
[]
[null,"Scroll down for Scottish Tax Bands and Pension Calculations",null,null,null,null,null,null,"Input the Annual Allowance and Total Taxable Income and the calculations will be made for you!"]
[]
[null,"Annual Allowance",{"$f":"F4","v":12500},null,{"$f":"Data!C7","v":"1250L"},{"$f":"IF(RIGHT(E4,1)=\"L\",E5,IF(RIGHT(E4,1)=\"M\",E5,IF(RIGHT(E4,1)=\"n\",E5,IF(RIGHT(E4,1)=\"T\",E5,0))))","v":12500}]
[null,"Total taxable income",{"$f":"Calculation!F17","v":0},null,{"$f":"(LEFT(E4,LEN(E4)-1))*10","v":12500}]
[]
[]
[null,"Income Tax Calculations",null,null,null,null,null,null,null,null,null,null,null,null,null,null,null,null,null,null,null,null,"weekly","Fortnightly","4-weekly","monthly"]
[null,null,null,"Weekly ",null,null,null,"F/nightly",null,null,null,"4-weekly",null,null,null,"Monthly",null,null,null,null,null,"BR",721,1442,2885,3125]
[null,null,null,"Allowance",{"$f":"C4/52*Data!L22","v":240.38461538461539},null,null,"Allowance",{"$f":"C4/26","v":480.76923076923077},null,null,"Allowance",{"$f":"C4/13","v":961.53846153846155},null,null,"Allowance",{"$f":"C4/12","v":1041.6666666666667},null,null,null,null,"HR",2163,4327,8654,9375]
[null,null,null,"Income",{"$f":"C5","v":0},null,null,"Income ",{"$f":"C5","v":0},null,null,"Income",{"$f":"C5","v":0},null,null,"Income ",{"$f":"C5","v":0},null,null,null,null,"AR",2885,5770,11538,12500]
[null,null,null,"Minus PA",{"$f":"E11-E10","v":-240.38461538461539},null,null,"Minus PA",{"$f":"I11-I10","v":-480.76923076923077},null,null,"Minus PA",{"$f":"M11-M10","v":-961.53846153846155},null,null,"Minus PA",{"$f":"Q11-Q10","v":-1041.6666666666667}]
[]
[null,null,null,null,"Tax",null,null,null,"Tax",null,null,null,"Tax",null,null,null,"Tax"]
[null,null,0.2,{"$f":"IF(E12>BR_W,BR_W,E12)","v":-240.38461538461539},{"$f":"IF($E$4=\"BR\",ROUNDDOWN($C$5,0)*C15,IF($E$4=\"d0\",0,IF($E$4=\"D1\",0,ROUNDDOWN(D15,0)*C15)))","v":-48},null,0.2,{"$f":"IF(I12>BR_F,BR_F,I12)","v":-480.76923076923077},{"$f":"IF($E$4=\"BR\",ROUNDDOWN($C$5,0)*G15,IF($E$4=\"d0\",0,IF($E$4=\"D1\",0,ROUNDDOWN(H15,0)*G15)))","v":-96},null,0.2,{"$f":"IF(M12>BR_4W,BR_4W,M12)","v":-961.53846153846155},{"$f":"IF($E$4=\"BR\",ROUNDDOWN($C$5,0)*K15,IF($E$4=\"d0\",0,IF($E$4=\"D1\",0,ROUNDDOWN(L15,0)*K15)))","v":-192.20000000000002},null,0.2,{"$f":"IF(Q12>BR_M,BR_M,Q12)","v":-1041.6666666666667},{"$f":"IF($E$4=\"BR\",ROUNDDOWN($C$5,0)*O15,IF($E$4=\"d0\",0,IF($E$4=\"D1\",0,ROUNDDOWN(P15,0)*O15)))","v":-208.20000000000002},null,null,37500]
{"$rows_left_out":62}